BDBM370213 US10233188, Example 100::US10800783, Example 100::US11396512, Example 100
SMILES Cc1cc2cnc(NC3CCN(CC3)S(=O)(=O)NC[C@@H]3CCCO3)nc2n([C@@H]2CCC[C@@]2(C)O)c1=O
InChI Key InChIKey=ZAFRFGKCOSNMCP-DCLXLUIPSA-N
Data  6 KI
  Tab Delimited (TSV)   2D SDfile   Computed 3D by Vconf -m prep SDfile
Find this compound or compounds like it in BindingDB:
Activity Spreadsheet -- Enzyme Inhibition Constant Data from BindingDB
Found 6 hits for monomerid = 370213
TargetCyclin-dependent kinase 2/G1/S-specific cyclin-E1(Homo sapiens (Human))
Pfizer
US Patent
LigandPNGBDBM370213(US10233188, Example 100 | US10800783, Example 100 ...)
Affinity DataKi:  0.270nM. Assay description: The purpose of the CDK2/Cyclin E1 assay is to evaluate the inhibition (% inhibition, Kiapp and Ki values) of small molecule inhibitors by using a flu...
Ligand InfoPC cidPC sid
In DepthDetails US Patent
TargetCyclin-dependent kinase 2/G1/S-specific cyclin-E1(Homo sapiens (Human))
Pfizer
US Patent
LigandPNGBDBM370213(US10233188, Example 100 | US10800783, Example 100 ...)
Affinity DataKi:  0.270nM. Assay description: The purpose of the CDK2/Cyclin E1 assay is to evaluate the inhibition (% inhibition, Kiapp and Ki values) of small molecule inhibitors by using a flu...
Ligand InfoPC cidPC sid
In DepthDetails US Patent
TargetCyclin-dependent kinase 2/G1/S-specific cyclin-E1(Homo sapiens (Human))
Pfizer
US Patent
LigandPNGBDBM370213(US10233188, Example 100 | US10800783, Example 100 ...)
Affinity DataKi:  0.270nM. Assay description: The mobility shift assay electrophoretically separates the fluorescently labeled peptides (substrate and phosphorylated product) following the kinase...
Ligand InfoPC cidPC sid
In DepthDetails US Patent
TargetCyclin-dependent kinase 6/G1/S-specific cyclin-D1(Homo sapiens (Human))
Pfizer
US Patent
LigandPNGBDBM370213(US10233188, Example 100 | US10800783, Example 100 ...)
Affinity DataKi:  1.07nM. Assay description: The purpose of the CDK6/Cyclin D1 assay is to evaluate the inhibition (% inhibition, Kiapp and Ki values) in the presence of small molecule inhibitor...
Ligand InfoPC cidPC sid
In DepthDetails US Patent
TargetCyclin-dependent kinase 6/G1/S-specific cyclin-D1 [L188C](Homo sapiens (Human))
Pfizer
US Patent
LigandPNGBDBM370213(US10233188, Example 100 | US10800783, Example 100 ...)
Affinity DataKi:  1.07nM. Assay description: The purpose of the CDK6/Cyclin D1 assay is to evaluate the inhibition (% inhibition, Kiapp and Ki values) in the presence of small molecule inhibitor...
Ligand InfoPC cidPC sid
In DepthDetails US Patent
TargetCyclin-dependent kinase 6/G1/S-specific cyclin-D1(Homo sapiens (Human))
Pfizer
US Patent
LigandPNGBDBM370213(US10233188, Example 100 | US10800783, Example 100 ...)
Affinity DataKi:  1.07nM. Assay description: The purpose of the CDK6/Cyclin D1 assay is to evaluate the inhibition (% inhibition, Kiapp and Ki values) in the presence of small molecule inhibitor...
Ligand InfoPC cidPC sid
In DepthDetails US Patent