BDBM37036 MLS000087261::N-(3,4-dimethoxyphenyl)-5-(2-thienyl)isoxazole-3-carboxamide::N-(3,4-dimethoxyphenyl)-5-thien-2-ylisoxazole-3-carboxamide::N-(3,4-dimethoxyphenyl)-5-thiophen-2-yl-1,2-oxazole-3-carboxamide::N-(3,4-dimethoxyphenyl)-5-thiophen-2-yl-3-isoxazolecarboxamide::SMR000023484::cid_3236859
SMILES COc1ccc(NC(=O)c2cc(on2)-c2cccs2)cc1OC
InChI Key InChIKey=FJVNOLHYQKQRKL-UHFFFAOYSA-N
Data  3 EC50
  Tab Delimited (TSV)   2D SDfile   Computed 3D by Vconf -m prep SDfile
Find this compound or compounds like it in BindingDB:
Activity Spreadsheet -- Enzyme Inhibition Constant Data from BindingDB
Found 3 hits for monomerid = 37036
TargetSphingosine 1-phosphate receptor 1(Homo sapiens (Human))
The Scripps Research Institute Molecular Screening Center
Curated by PubChem BioAssay
LigandPNGBDBM37036(MLS000087261 | N-(3,4-dimethoxyphenyl)-5-(2-thieny...)
Affinity DataEC50:  5.28E+3nM. Assay description: Source (MLSCN Center Name): The Scripps Research Institute Molecular Screening Center Center Affiliation: The Scripps Research Institute, TSRI Assay ...
In DepthDetails PCBioAssay
TargetSphingosine 1-phosphate receptor 1(Homo sapiens (Human))
The Scripps Research Institute Molecular Screening Center
Curated by PubChem BioAssay
LigandPNGBDBM37036(MLS000087261 | N-(3,4-dimethoxyphenyl)-5-(2-thieny...)
Affinity DataEC50:  5.80E+3nM. Assay description: Source (MLSCN Center Name): The Scripps Research Institute Molecular Screening Center Center Affiliation: The Scripps Research Institute, TSRI Assay ...
In DepthDetails PCBioAssay
TargetSphingosine 1-phosphate receptor 1(Homo sapiens (Human))
The Scripps Research Institute Molecular Screening Center
Curated by PubChem BioAssay
LigandPNGBDBM37036(MLS000087261 | N-(3,4-dimethoxyphenyl)-5-(2-thieny...)
Affinity DataEC50: >9.51E+4nM. Assay description: Source (MLSCN Center Name): The Scripps Research Institute Molecular Screening Center Center Affiliation: The Scripps Research Institute, TSRI Assay ...
In DepthDetails PCBioAssay