BDBM370450 US10238638, Example 3
SMILES COc1cc(OCc2csc(n2)-c2ccc(cc2)C(=O)N(C)[C@H]2CCOC2)c2sc(nc2c1)-c1cn2nc(C)sc2n1
InChI Key InChIKey=FSEPKRVFPRHIRB-FQEVSTJZSA-N
Data  1 IC50
  Tab Delimited (TSV)   2D SDfile   Computed 3D by Vconf -m prep SDfile
Find this compound or compounds like it in BindingDB:
Activity Spreadsheet -- Enzyme Inhibition Constant Data from BindingDB
Found 1 hit for monomerid = 370450
TargetPRKC apoptosis WT1 regulator protein(Homo sapiens (Human))
Universite De Montreal
US Patent
LigandPNGBDBM370450(US10238638, Example 3)
Affinity DataIC50:  3.60E+3nM. Assay description: The FLIPR assay is an exemplary in vitro assay for measuring the activity of the PAR4 antagonists of the present invention. In this assay, intracellu...
Ligand InfoPC cidPC sid
In DepthDetails US Patent