BDBM370455 US10233190, Example 1363::tert-butyl 4-(1-hydroxy-2-(5H-imidazo[5,1- a]isoindol-5-yl)ethyl)piperidine-1-carboxylate
SMILES CC(C)(C)OC(=O)N1CCC(CC1)C(O)CC1c2ccccc2-c2cncn12
InChI Key InChIKey=QYRWUEOAQAHUBN-UHFFFAOYSA-N
Data  2 IC50  1 EC50
  Tab Delimited (TSV)   2D SDfile   Computed 3D by Vconf -m prep SDfile
Find this compound or compounds like it in BindingDB:
Activity Spreadsheet -- Enzyme Inhibition Constant Data from BindingDB
Found 3 hits for monomerid = 370455
TargetIndoleamine 2,3-dioxygenase 1(Homo sapiens (Human))
Newlink Genetics
US Patent
LigandPNGBDBM370455(US10233190, Example 1363 | tert-butyl 4-(1-hydroxy...)
Affinity DataIC50: <1.00E+3nM. Assay description: The IC50 values for each compound were determined by testing the activity of IDO in a mixture containing 50 mM potassium phosphate buffer at pH 6.5; ...
Ligand InfoPC cidPC sid
In DepthDetails US Patent
TargetIndoleamine 2,3-dioxygenase 1(Homo sapiens (Human))
Newlink Genetics
US Patent
LigandPNGBDBM370455(US10233190, Example 1363 | tert-butyl 4-(1-hydroxy...)
Affinity DataEC50:  240nM. Assay description: Inhibition of recombinant human IDO1 expressed in T-REx-293 cells assessed as reduction in kynurenine level measured after 16 hrs
Ligand InfoPC cidPC sid
In DepthDetails ArticlePubMed
TargetIndoleamine 2,3-dioxygenase 1(Homo sapiens (Human))
Newlink Genetics
US Patent
LigandPNGBDBM370455(US10233190, Example 1363 | tert-butyl 4-(1-hydroxy...)
Affinity DataIC50:  140nM. Assay description: Inhibition of purified human IDO1 using L-tryptophan as substrate preincubated for 5 mins followed by substrate addition and measured after 15 mins b...
Ligand InfoPC cidPC sid
In DepthDetails ArticlePubMed