BDBM370501 1-cyclohexyl-2-(5H-imidazo[5,1-a]isoindol-5- yl)ethyl acetate::US10233190, Example 1420
SMILES CC(=O)OC(CC1c2ccccc2-c2cncn12)C1CCCCC1
InChI Key InChIKey=HVZJGGWTHITDQX-UHFFFAOYSA-N
Data  1 IC50
  Tab Delimited (TSV)   2D SDfile   Computed 3D by Vconf -m prep SDfile
Find this compound or compounds like it in BindingDB:
Activity Spreadsheet -- Enzyme Inhibition Constant Data from BindingDB
Found 1 hit for monomerid = 370501
TargetIndoleamine 2,3-dioxygenase 1(Homo sapiens (Human))
Newlink Genetics
US Patent
LigandPNGBDBM370501(1-cyclohexyl-2-(5H-imidazo[5,1-a]isoindol-5- yl)et...)
Affinity DataIC50:  5.50E+3nM. Assay description: The IC50 values for each compound were determined by testing the activity of IDO in a mixture containing 50 mM potassium phosphate buffer at pH 6.5; ...
Ligand InfoPC cidPC sid
In DepthDetails US Patent