BDBM370509 4-(1-cyclohexyl-2-(5H-imidazo[5,1-a]isoindol-5- yl)ethoxy)-4-oxobutanoic acid::US10233190, Example 1428
SMILES OC(=O)CCC(=O)OC(CC1c2ccccc2-c2cncn12)C1CCCCC1
InChI Key InChIKey=KECJSORXVGLSAH-UHFFFAOYSA-N
Data  1 IC50
  Tab Delimited (TSV)   2D SDfile   Computed 3D by Vconf -m prep SDfile
Find this compound or compounds like it in BindingDB:
Activity Spreadsheet -- Enzyme Inhibition Constant Data from BindingDB
Found 1 hit for monomerid = 370509
TargetIndoleamine 2,3-dioxygenase 1(Homo sapiens (Human))
Newlink Genetics
US Patent
LigandPNGBDBM370509(4-(1-cyclohexyl-2-(5H-imidazo[5,1-a]isoindol-5- yl...)
Affinity DataIC50:  550nM. Assay description: The IC50 values for each compound were determined by testing the activity of IDO in a mixture containing 50 mM potassium phosphate buffer at pH 6.5; ...
Ligand InfoPC cidPC sid
In DepthDetails US Patent