BDBM370544 4-((R)-1-hydroxy-2-((R)-5H-imidazo[5,1- a]isoindol-5-yl)ethyl)-N-phenylpiperidine-1- carboxamide::US10233190, Example 1477
SMILES O[C@H](C[C@@H]1c2ccccc2-c2cncn12)C1CCN(CC1)C(=O)Nc1ccccc1
InChI Key InChIKey=YQNFLDBZFLCLLR-FYYLOGMGSA-N
Data  1 IC50
  Tab Delimited (TSV)   2D SDfile   Computed 3D by Vconf -m prep SDfile
Find this compound or compounds like it in BindingDB:
Activity Spreadsheet -- Enzyme Inhibition Constant Data from BindingDB
Found 1 hit for monomerid = 370544
TargetIndoleamine 2,3-dioxygenase 1(Homo sapiens (Human))
Newlink Genetics
US Patent
LigandPNGBDBM370544(4-((R)-1-hydroxy-2-((R)-5H-imidazo[5,1- a]isoindol...)
Affinity DataIC50:  550nM. Assay description: The IC50 values for each compound were determined by testing the activity of IDO in a mixture containing 50 mM potassium phosphate buffer at pH 6.5; ...
Ligand InfoPC cidPC sid
In DepthDetails US Patent