BDBM370662 US10238743, Example 37
SMILES CN1C(=N)N[C@@]2(C)[C@@H](CCCc3ccc(NC(=O)c4ccc(F)cn4)cc23)S1(=O)=O
InChI Key InChIKey=CYYGFSQYPWRMCV-YLJYHZDGSA-N
Data  2 KI
  Tab Delimited (TSV)   2D SDfile   Computed 3D by Vconf -m prep SDfile
Find this compound or compounds like it in BindingDB:
Activity Spreadsheet -- Enzyme Inhibition Constant Data from BindingDB
Found 2 hits for monomerid = 370662
TargetBeta-secretase 2(Homo sapiens (Human))
TBA
US Patent
LigandPNGBDBM370662(US10238743, Example 37)
Affinity DataKi:  96nM. Assay description: Inhibitor IC50s at purified human autoBACE-2 are determined in a time-resolved endpoint proteolysis assay that measures hydrolysis of the QSY7-EISEVN...
Ligand InfoPC cidPC sid
In DepthDetails US Patent
TargetBeta-secretase 1(Homo sapiens (Human))
TBA
US Patent
LigandPNGBDBM370662(US10238743, Example 37)
Affinity DataKi:  159nM. Assay description: A homogeneous time-resolved FRET assay can be used to determine IC50 values for inhibitors of the soluble human BACE1 catalytic domain. This assay mo...
Ligand InfoPC cidPC sid
In DepthDetails US Patent