BDBM370672 US10238743, Example 47
SMILES CN1C(=N)N[C@@]2(C)[C@H](CCOc3ccc(NC4CCCC4)cc23)S1(=O)=O
InChI Key InChIKey=RWPYRLCUTYIVDS-FUHWJXTLSA-N
Data  2 KI
  Tab Delimited (TSV)   2D SDfile   Computed 3D by Vconf -m prep SDfile
Find this compound or compounds like it in BindingDB:
Activity Spreadsheet -- Enzyme Inhibition Constant Data from BindingDB
Found 2 hits for monomerid = 370672
TargetBeta-secretase 1(Homo sapiens (Human))
TBA
US Patent
LigandPNGBDBM370672(US10238743, Example 47)
Affinity DataKi:  348nM. Assay description: A homogeneous time-resolved FRET assay can be used to determine IC50 values for inhibitors of the soluble human BACE1 catalytic domain. This assay mo...
Ligand InfoPC cidPC sid
In DepthDetails US Patent
TargetBeta-secretase 2(Homo sapiens (Human))
TBA
US Patent
LigandPNGBDBM370672(US10238743, Example 47)
Affinity DataKi:  716nM. Assay description: Inhibitor IC50s at purified human autoBACE-2 are determined in a time-resolved endpoint proteolysis assay that measures hydrolysis of the QSY7-EISEVN...
Ligand InfoPC cidPC sid
In DepthDetails US Patent