BDBM370753 US10239835, Example 00305
SMILES [H][C@@]12C[C@H](C[C@]1([H])CN(CC(=O)c1ccc(O)c(F)c1)C2)Oc1cccnc1F
InChI Key InChIKey=LXTIZBVRJZXQKZ-FICVDOATSA-N
Data  1 IC50
  Tab Delimited (TSV)   2D SDfile   Computed 3D by Vconf -m prep SDfile
Find this compound or compounds like it in BindingDB:
Activity Spreadsheet -- Enzyme Inhibition Constant Data from BindingDB
Found 1 hit for monomerid = 370753
TargetGlutamate receptor ionotropic, NMDA 1/2B(Homo sapiens (Human))
Cadent Therapeutics
US Patent
LigandPNGBDBM370753(US10239835, Example 00305)
Affinity DataIC50:  1.00E+4nM. Assay description: Cell Culture and plating: HEK293 cells expressing NR1/NR2B (Chantest, Cleveland, Ohio) were grown to 70-80% confluency as an adherent monolayer in st...
Ligand InfoPC cidPC sid
In DepthDetails US Patent