BDBM370843 US10239838, Example 32
SMILES CCN(CCc1cccc(n1)C(C)(C)O)C(=O)c1ccccc1-c1ncccn1
InChI Key InChIKey=VMWCGJBVHQIQLB-UHFFFAOYSA-N
Data  2 IC50
  Tab Delimited (TSV)   2D SDfile   Computed 3D by Vconf -m prep SDfile
Find this compound or compounds like it in BindingDB:
Activity Spreadsheet -- Enzyme Inhibition Constant Data from BindingDB
Found 2 hits for monomerid = 370843
TargetOrexin/Hypocretin receptor type 1(Homo sapiens (Human))
Merck Sharp & Dohme
US Patent
LigandPNGBDBM370843(US10239838, Example 32)
Affinity DataIC50:  7.36E+3nM. Assay description: In a typical experiment the OX1 and OX2 receptor antagonistic activity of the compounds of the present invention was determined in accordance with th...
Ligand InfoPC cidPC sid
In DepthDetails US Patent
TargetOrexin receptor type 2(Homo sapiens (Human))
Merck Sharp & Dohme
US Patent
LigandPNGBDBM370843(US10239838, Example 32)
Affinity DataIC50:  16nM. Assay description: In a typical experiment the OX1 and OX2 receptor antagonistic activity of the compounds of the present invention was determined in accordance with th...
Ligand InfoPC cidPC sid
In DepthDetails US Patent