BDBM371073 US10239843, Example 180
SMILES Cc1cc(Cn2c(=O)n(C)c3ccc(cc3c2=O)S(=O)(=O)NC2(C)CC2)on1
InChI Key InChIKey=JXROTDVXUCWZRJ-UHFFFAOYSA-N
Data  3 IC50  1 EC50
  Tab Delimited (TSV)   2D SDfile   Computed 3D by Vconf -m prep SDfile
Find this compound or compounds like it in BindingDB:
Activity Spreadsheet -- Enzyme Inhibition Constant Data from BindingDB
Found 4 hits for monomerid = 371073
TargetPoly(ADP-ribose) glycohydrolase(Homo sapiens (Human))
Cancer Research Technology
US Patent
LigandPNGBDBM371073(US10239843, Example 180)
Affinity DataIC50:  426nM. Assay description: PARG In vitro assays were conducted in a total volume of 15 ul in a standard 384 well format. 5 ul of Human Full Length PARG (Produced internally by ...
Ligand InfoPC cidPC sid
In DepthDetails US Patent
TargetPoly(ADP-ribose) glycohydrolase(Homo sapiens (Human))
Cancer Research Technology
US Patent
LigandPNGBDBM371073(US10239843, Example 180)
Affinity DataEC50:  470nM. Assay description: Inhibition of human full length PARG using Bt-NAD ribosylated PARP1 substrate after 10 mins by TR-FRET assay
Ligand InfoPC cidPC sid
In DepthDetails ArticlePubMed
TargetPoly [ADP-ribose] polymerase 1(Homo sapiens (Human))
Cancer Research Technology
US Patent
LigandPNGBDBM371073(US10239843, Example 180)
Affinity DataIC50: >1.50E+5nM. Assay description: PARP1 In vitro selectivity assays were conducted as a 10 ul reaction volume in a NUNC Maxisorp 384-well assay plate pre-coated in-house with Histones...
Ligand InfoPC cidPC sid
In DepthDetails US Patent
TargetADP-ribosylhydrolase ARH3(Homo sapiens (Human))
Cancer Research Technology
US Patent
LigandPNGBDBM371073(US10239843, Example 180)
Affinity DataIC50: >1.50E+5nM. Assay description: ARH3 In vitro selectivity assays were conducted in a total volume of 15 ul in a standard 384 well format. 5 ul of Human Full Length ARH3 (Enzo Life S...
Ligand InfoPC cidPC sid
In DepthDetails US Patent