BDBM37126 1-(4-methylphenyl)-5-[(3,4,5-trimethoxybenzyl)thio]-1H-tetrazole::1-(4-methylphenyl)-5-[(3,4,5-trimethoxyphenyl)methylsulfanyl]-1,2,3,4-tetrazole::1-(4-methylphenyl)-5-[(3,4,5-trimethoxyphenyl)methylsulfanyl]tetrazole::1-(4-methylphenyl)-5-[(3,4,5-trimethoxyphenyl)methylthio]tetrazole::1-(p-tolyl)-5-[(3,4,5-trimethoxybenzyl)thio]tetrazole::MLS000051930::SMR000081102::cid_992688
SMILES COc1cc(CSc2nnnn2-c2ccc(C)cc2)cc(OC)c1OC
InChI Key InChIKey=ZCOHOUIKFBCXOF-UHFFFAOYSA-N
Data  5 IC50  3 EC50
  Tab Delimited (TSV)   2D SDfile   Computed 3D by Vconf -m prep SDfile
Find this compound or compounds like it in BindingDB:
Activity Spreadsheet -- Enzyme Inhibition Constant Data from BindingDB
Found 8 hits for monomerid = 37126
TargetSphingosine 1-phosphate receptor 1(Homo sapiens (Human))
The Scripps Research Institute Molecular Screening Center
Curated by PubChem BioAssay
LigandPNGBDBM37126(1-(4-methylphenyl)-5-[(3,4,5-trimethoxybenzyl)thio...)
Affinity DataEC50:  2.87E+3nM. Assay description: Source (MLSCN Center Name): The Scripps Research Institute Molecular Screening Center Center Affiliation: The Scripps Research Institute, TSRI Assay ...
In DepthDetails PCBioAssay
TargetSphingosine 1-phosphate receptor 1(Homo sapiens (Human))
The Scripps Research Institute Molecular Screening Center
Curated by PubChem BioAssay
LigandPNGBDBM37126(1-(4-methylphenyl)-5-[(3,4,5-trimethoxybenzyl)thio...)
Affinity DataEC50: >3.00E+4nM. Assay description: Source (MLSCN Center Name): The Scripps Research Institute Molecular Screening Center Center Affiliation: The Scripps Research Institute, TSRI Assay ...
In DepthDetails PCBioAssay
TargetSphingosine 1-phosphate receptor 1(Homo sapiens (Human))
The Scripps Research Institute Molecular Screening Center
Curated by PubChem BioAssay
LigandPNGBDBM37126(1-(4-methylphenyl)-5-[(3,4,5-trimethoxybenzyl)thio...)
Affinity DataEC50:  2.26E+3nM. Assay description: Source (MLSCN Center Name): The Scripps Research Institute Molecular Screening Center Center Affiliation: The Scripps Research Institute, TSRI Assay ...
In DepthDetails PCBioAssay
TargetGalanin receptor type 3(Homo sapiens (Human))
The Scripps Research Institute Molecular Screening Center
Curated by PubChem BioAssay
LigandPNGBDBM37126(1-(4-methylphenyl)-5-[(3,4,5-trimethoxybenzyl)thio...)
Affinity DataIC50:  1.22E+3nM
In DepthDetails PCBioAssay
TargetIsoform 2 of Nuclear receptor ROR-alpha (Alpha-2)(Homo sapiens (Human))
The Scripps Research Institute Molecular Screening Center
Curated by PubChem BioAssay
LigandPNGBDBM37126(1-(4-methylphenyl)-5-[(3,4,5-trimethoxybenzyl)thio...)
Affinity DataIC50:  2.69E+3nM. Assay description: Source (MLSCN Center Name): The Scripps Research Institute Molecular Screening Center Center Affiliation: The Scripps Research Institute, TSRI Assay ...
In DepthDetails PCBioAssay
TargetSteroidogenic factor 1(Homo sapiens (Human))
The Scripps Research Institute Molecular Screening Center
Curated by PubChem BioAssay
LigandPNGBDBM37126(1-(4-methylphenyl)-5-[(3,4,5-trimethoxybenzyl)thio...)
Affinity DataIC50:  4.52E+3nM. Assay description: Source (MLSCN Center Name): The Scripps Research Institute Molecular Screening Center Center Affiliation: The Scripps Research Institute, TSRI Assay ...
In DepthDetails PCBioAssay
TargetIsoform 2 of Nuclear receptor ROR-alpha (Alpha-2)(Homo sapiens (Human))
The Scripps Research Institute Molecular Screening Center
Curated by PubChem BioAssay
LigandPNGBDBM37126(1-(4-methylphenyl)-5-[(3,4,5-trimethoxybenzyl)thio...)
Affinity DataIC50:  6.07E+3nM. Assay description: Source (MLSCN Center Name): The Scripps Research Institute Molecular Screening Center Center Affiliation: The Scripps Research Institute, TSRI Assay ...
In DepthDetails PCBioAssay
TargetSteroidogenic factor 1(Homo sapiens (Human))
The Scripps Research Institute Molecular Screening Center
Curated by PubChem BioAssay
LigandPNGBDBM37126(1-(4-methylphenyl)-5-[(3,4,5-trimethoxybenzyl)thio...)
Affinity DataIC50:  1.69E+4nM. Assay description: Source (MLSCN Center Name): The Scripps Research Institute Molecular Screening Center Center Affiliation: The Scripps Research Institute, TSRI Assay ...
In DepthDetails PCBioAssay