BDBM37155 MLS000115086::N-[4-[5-(3,4-dimethoxyphenyl)-1,2,4-oxadiazol-3-yl]phenyl]-4-pyridinecarboxamide::N-[4-[5-(3,4-dimethoxyphenyl)-1,2,4-oxadiazol-3-yl]phenyl]isonicotinamide::N-[4-[5-(3,4-dimethoxyphenyl)-1,2,4-oxadiazol-3-yl]phenyl]pyridine-4-carboxamide::SMR000092318::cid_4457834
SMILES COc1ccc(cc1OC)-c1nc(no1)-c1ccc(NC(=O)c2ccncc2)cc1
InChI Key InChIKey=RSXIBWUIMVLNRR-UHFFFAOYSA-N
Data  4 EC50
  Tab Delimited (TSV)   2D SDfile   Computed 3D by Vconf -m prep SDfile
Find this compound or compounds like it in BindingDB:
Activity Spreadsheet -- Enzyme Inhibition Constant Data from BindingDB
Found 4 hits for monomerid = 37155
TargetSphingosine 1-phosphate receptor 1(Homo sapiens (Human))
The Scripps Research Institute Molecular Screening Center
Curated by PubChem BioAssay
LigandPNGBDBM37155(MLS000115086 | N-[4-[5-(3,4-dimethoxyphenyl)-1,2,4...)
Affinity DataEC50:  685nM. Assay description: Source (MLSCN Center Name): The Scripps Research Institute Molecular Screening Center Center Affiliation: The Scripps Research Institute, TSRI Assay ...
In DepthDetails PCBioAssay
TargetTumor necrosis factor receptor superfamily member 10B(Homo sapiens (Human))
Burnham Center For Chemical Genomics
Curated by PubChem BioAssay
LigandPNGBDBM37155(MLS000115086 | N-[4-[5-(3,4-dimethoxyphenyl)-1,2,4...)
Affinity DataEC50: >1.25E+4nM
In DepthDetails PCBioAssay
TargetSphingosine 1-phosphate receptor 1(Homo sapiens (Human))
The Scripps Research Institute Molecular Screening Center
Curated by PubChem BioAssay
LigandPNGBDBM37155(MLS000115086 | N-[4-[5-(3,4-dimethoxyphenyl)-1,2,4...)
Affinity DataEC50:  946nM. Assay description: Source (MLSCN Center Name): The Scripps Research Institute Molecular Screening Center Center Affiliation: The Scripps Research Institute, TSRI Assay ...
In DepthDetails PCBioAssay
TargetSphingosine 1-phosphate receptor 1(Homo sapiens (Human))
The Scripps Research Institute Molecular Screening Center
Curated by PubChem BioAssay
LigandPNGBDBM37155(MLS000115086 | N-[4-[5-(3,4-dimethoxyphenyl)-1,2,4...)
Affinity DataEC50: >3.00E+4nM. Assay description: Source (MLSCN Center Name): The Scripps Research Institute Molecular Screening Center Center Affiliation: The Scripps Research Institute, TSRI Assay ...
In DepthDetails PCBioAssay