BDBM371554 US10239861, Example 34::racemic-5-((1-benzylpiperidin-3-yl)amino)-4-chloro-2-methylpyridazin-3(2H)-one
SMILES Cn1ncc(NC2CCCN(Cc3ccccc3)C2)c(Cl)c1=O
InChI Key InChIKey=XPMSGNKIIJCSLZ-UHFFFAOYSA-N
Data  1 IC50
  Tab Delimited (TSV)   2D SDfile   Computed 3D by Vconf -m prep SDfile
Find this compound or compounds like it in BindingDB:
Activity Spreadsheet -- Enzyme Inhibition Constant Data from BindingDB
Found 1 hit for monomerid = 371554
TargetHistone acetyltransferase KAT2B(Homo sapiens (Human))
Genetech
US Patent
LigandPNGBDBM371554(US10239861, Example 34 | racemic-5-((1-benzylpiper...)
Affinity DataIC50:  155nM. Assay description: His/Flag epitope tagged PCAF719-832 bromodomain was cloned, expressed and purified to homogeneity in-house. PCAF bromodomain binding and inhibition o...
In DepthDetails US Patent