BDBM371898 US10239870, Example 122
SMILES Cn1c(SCCCN2CC[C@]3(CC3c3ccc(cc3)C(F)(F)F)C2)nnc1-c1cccc(=O)[nH]1
InChI Key
Data  2 KI
  Tab Delimited (TSV)   2D SDfile   Computed 3D by Vconf -m prep SDfile
Find this compound or compounds like it in BindingDB:
Activity Spreadsheet -- Enzyme Inhibition Constant Data from BindingDB
Found 2 hits for monomerid = 371898
TargetD(3) dopamine receptor(Rattus norvegicus (Rat))
Indivior
US Patent
LigandPNGBDBM371898(US10239870, Example 122)
Affinity DataKi:  2.57nM. Assay description: [125I]-7OH-PIPAT Binding Assay at rat native D3 receptor on membranes from rat ventral striatum. Homogenates from frozen rat brain ventral striatum (...
Ligand InfoPC cidPC sid
In DepthDetails US Patent
TargetD(2) dopamine receptor(Homo sapiens (Human))
Indivior
US Patent
LigandPNGBDBM371898(US10239870, Example 122)
Affinity DataKi:  457nM. Assay description: CHO cells stably expressing human dopamine receptor type 2, long variant (hD2L), coupled to Gα16 protein (CHO-Gα16-hD2L) were re-suspended ...
Ligand InfoPC cidPC sid
In DepthDetails US Patent