BDBM372085 N-(6-Cyanopyridin-2-yl)-2-[4-oxo-1-phenyl-8-(1H-pyrazolo[3,4-b]pyridine-5-carbonyl)-1,3,8-triazaspiro[4.5]decan-3-yl]acetamide::US10239876, Example 108::US10435407, Example 108
SMILES O=C(CN1CN(c2ccccc2)C2(CCN(CC2)C(=O)c2cnc3[nH]ncc3c2)C1=O)Nc1cccc(n1)C#N
InChI Key InChIKey=QHBOCRGDNDMWPF-UHFFFAOYSA-N
Data  2 IC50
  Tab Delimited (TSV)   2D SDfile   Computed 3D by Vconf -m prep SDfile
Find this compound or compounds like it in BindingDB:
Activity Spreadsheet -- Enzyme Inhibition Constant Data from BindingDB
Found 2 hits for monomerid = 372085
TargetEpithelial discoidin domain-containing receptor 1(Homo sapiens (Human))
Hoffmann-La Roche
US Patent
LigandPNGBDBM372085(N-(6-Cyanopyridin-2-yl)-2-[4-oxo-1-phenyl-8-(1H-py...)
Affinity DataIC50:  33.3nM. Assay description: This assay is based on the intracellular domain of the DDR1 protein which contains the kinase active site. The recombinant protein additionally carri...
Ligand InfoPC cidPC sid
In DepthDetails US Patent
TargetD(1A) dopamine receptor(Homo sapiens (Human))
Hoffmann-La Roche
US Patent
LigandPNGBDBM372085(N-(6-Cyanopyridin-2-yl)-2-[4-oxo-1-phenyl-8-(1H-py...)
Affinity DataIC50:  33.3nM. Assay description: This assay is based on the intracellular domain of the DDR1 protein which contains the kinase active site. The recombinant protein additionally carri...
Ligand InfoPC cidPC sid
In DepthDetails US Patent