BDBM3721 2-({4-[(3-bromophenyl)amino]pyrido[3,4-d]pyrimidin-6-yl}(methyl)amino)acetic acid::4-[(3-Bromophenyl)amino]-6-[N-(carboxymethyl)methylamino]pyrido[3,4-d]pyrimidine::PD158780 Analog 5y
SMILES CN(CC(O)=O)c1cc2c(Nc3cccc(Br)c3)ncnc2cn1
InChI Key InChIKey=UFGHDYZMVXQBKH-UHFFFAOYSA-N
Data  1 IC50
  Tab Delimited (TSV)   2D SDfile   Computed 3D by Vconf -m prep SDfile
Find this compound or compounds like it in BindingDB:
Activity Spreadsheet -- Enzyme Inhibition Constant Data from BindingDB
Found 1 hit for monomerid = 3721
TargetEpidermal growth factor receptor(Homo sapiens (Human))
University Of Auckland
LigandPNGBDBM3721(2-({4-[(3-bromophenyl)amino]pyrido[3,4-d]pyrimidin...)
Affinity DataIC50:  0.440nM. Assay description: IC50 is the inhibitor concentration which inhibits 50% of kinase activity that catalyzes the transfer of the terminal phosphate from [gamma-32P] labe...
In DepthDetails ArticlePubMed