BDBM372100 N-(2-(2-((4-methylpiperazin-1-yl)methyl)phenyl)cyclopropyl)-2-(4-oxo-1-phenyl-8-(1H-pyrazolo[3,4-b]pyridine-5-carbonyl)-1,3,8-triazaspiro[4.5]decan-3-yl)acetamide::US10239876, Example 123::US10435407, Example 123
SMILES CN1CCN(Cc2ccccc2C2CC2NC(=O)CN2CN(c3ccccc3)C3(CCN(CC3)C(=O)c3cnc4[nH]ncc4c3)C2=O)CC1
InChI Key
Data  2 IC50
  Tab Delimited (TSV)   2D SDfile   Computed 3D by Vconf -m prep SDfile
Find this compound or compounds like it in BindingDB:
Activity Spreadsheet -- Enzyme Inhibition Constant Data from BindingDB
Found 2 hits for monomerid = 372100
TargetEpithelial discoidin domain-containing receptor 1(Homo sapiens (Human))
Hoffmann-La Roche
US Patent
LigandPNGBDBM372100(N-(2-(2-((4-methylpiperazin-1-yl)methyl)phenyl)cyc...)
Affinity DataIC50:  45.6nM. Assay description: This assay is based on the intracellular domain of the DDR1 protein which contains the kinase active site. The recombinant protein additionally carri...
Ligand InfoPC cidPC sid
In DepthDetails US Patent
TargetD(1A) dopamine receptor(Homo sapiens (Human))
Hoffmann-La Roche
US Patent
LigandPNGBDBM372100(N-(2-(2-((4-methylpiperazin-1-yl)methyl)phenyl)cyc...)
Affinity DataIC50:  45.6nM. Assay description: This assay is based on the intracellular domain of the DDR1 protein which contains the kinase active site. The recombinant protein additionally carri...
Ligand InfoPC cidPC sid
In DepthDetails US Patent