BDBM372132 N-[2-(dimethylamino)ethyl]-2-[8-(1H-indazole-5-carbonyl)-4-oxo-1-phenyl-1,3,8-triazaspiro[4.5]decan-3-yl]-N-(2,2,2-trifluoroethyl)acetamide::US10239876, Example 155::US10435407, Example 155
SMILES CN(C)CCN(CC(F)(F)F)C(=O)CN1CN(c2ccccc2)C2(CCN(CC2)C(=O)c2ccc3[nH]ncc3c2)C1=O
InChI Key InChIKey=UKRJOFUVKHRCMD-UHFFFAOYSA-N
Data  2 IC50
  Tab Delimited (TSV)   2D SDfile   Computed 3D by Vconf -m prep SDfile
Find this compound or compounds like it in BindingDB:
Activity Spreadsheet -- Enzyme Inhibition Constant Data from BindingDB
Found 2 hits for monomerid = 372132
TargetEpithelial discoidin domain-containing receptor 1(Homo sapiens (Human))
Hoffmann-La Roche
US Patent
LigandPNGBDBM372132(N-[2-(dimethylamino)ethyl]-2-[8-(1H-indazole-5-car...)
Affinity DataIC50:  75.3nM. Assay description: This assay is based on the intracellular domain of the DDR1 protein which contains the kinase active site. The recombinant protein additionally carri...
Ligand InfoPC cidPC sid
In DepthDetails US Patent
TargetD(1A) dopamine receptor(Homo sapiens (Human))
Hoffmann-La Roche
US Patent
LigandPNGBDBM372132(N-[2-(dimethylamino)ethyl]-2-[8-(1H-indazole-5-car...)
Affinity DataIC50:  75.3nM. Assay description: This assay is based on the intracellular domain of the DDR1 protein which contains the kinase active site. The recombinant protein additionally carri...
Ligand InfoPC cidPC sid
In DepthDetails US Patent