BDBM372156 N-(3-((4- methylpiperazin-1- yl)methyl)phenyl)- 6-(o-tolyl)-5H- pyrrolo[3,2-d] pyrimidin-2-amine::US10239881, Example A9::US10875863, Example A9
SMILES CN1CCN(Cc2cccc(Nc3ncc4[nH]c(cc4n3)-c3ccccc3C)c2)CC1
InChI Key InChIKey=SPVDVGUFWOPGCZ-UHFFFAOYSA-N
Data  2 IC50
  Tab Delimited (TSV)   2D SDfile   Computed 3D by Vconf -m prep SDfile
Find this compound or compounds like it in BindingDB:
Activity Spreadsheet -- Enzyme Inhibition Constant Data from BindingDB
Found 2 hits for monomerid = 372156
TargetReceptor-interacting serine/threonine-protein kinase 2(Homo sapiens (Human))
University Health Network
US Patent
LigandPNGBDBM372156(N-(3-((4- methylpiperazin-1- yl)methyl)phenyl)- 6-...)
Affinity DataIC50: <100nM. Assay description: Active RIPK2 was purchased from Life Technologies as His-tagged of catalytic domain (amin acids 1-299) of human RIPK2 kinase expressed in insect cell...
Ligand InfoPC cidPC sid
In DepthDetails US Patent
TargetReceptor-interacting serine/threonine-protein kinase 2(Homo sapiens (Human))
University Health Network
US Patent
LigandPNGBDBM372156(N-(3-((4- methylpiperazin-1- yl)methyl)phenyl)- 6-...)
Affinity DataIC50: <100nM. Assay description: RIPK2 activity was measured using an indirect ELISA detection system. His—RIPK2 (0.6 nM) was incubated in the presence of 6 μM ATP (Sigma cat # ...
Ligand InfoPC cidPC sid
In DepthDetails US Patent