BDBM372221 US10239882, Example 16
SMILES Cc1cc(C2CCOCC2)n2nc(NCc3ccc4OCCOc4c3)nc2n1
InChI Key InChIKey=ZQYCJJGOJALDAG-UHFFFAOYSA-N
Data  1 IC50
  Tab Delimited (TSV)   2D SDfile   Computed 3D by Vconf -m prep SDfile
Find this compound or compounds like it in BindingDB:
Activity Spreadsheet -- Enzyme Inhibition Constant Data from BindingDB
Found 1 hit for monomerid = 372221
TargetcGMP-dependent 3',5'-cyclic phosphodiesterase(Homo sapiens (Human))
Dart Neuroscience (Cayman)
US Patent
LigandPNGBDBM372221(US10239882, Example 16)
Affinity DataIC50:  550nM. Assay description: An IMAP TR-FRET-based phosphodiesterase assay was developed using the PDE2A isoform. IMAP technology is based on high-affinity binding of phosphate b...
Ligand InfoPC cidPC sid
In DepthDetails US Patent