BDBM372249 US10239882, Example 75
SMILES COc1ccc(CNc2nc3nc(C)cc(n3n2)C2(C)CC2)cc1
InChI Key InChIKey=LZBBPTQOCXBUEW-UHFFFAOYSA-N
Data  1 IC50
  Tab Delimited (TSV)   2D SDfile   Computed 3D by Vconf -m prep SDfile
Find this compound or compounds like it in BindingDB:
Activity Spreadsheet -- Enzyme Inhibition Constant Data from BindingDB
Found 1 hit for monomerid = 372249
TargetcGMP-dependent 3',5'-cyclic phosphodiesterase(Homo sapiens (Human))
Dart Neuroscience (Cayman)
US Patent
LigandPNGBDBM372249(US10239882, Example 75)
Affinity DataIC50:  550nM. Assay description: An IMAP TR-FRET-based phosphodiesterase assay was developed using the PDE2A isoform. IMAP technology is based on high-affinity binding of phosphate b...
Ligand InfoPC cidPC sid
In DepthDetails US Patent