BDBM372282 8-(3,3-difluoroazetidin- 1-yl)-3,4-dimethylpyrimido [4',5':4,5]thieno[2,3-c] pyridazine::US10239887, Cpd. No. 21
SMILES Cc1nnc2sc3c(ncnc3c2c1C)N1CC(F)(F)C1
InChI Key InChIKey=BJFURVMZXZEASW-UHFFFAOYSA-N
Data  1 EC50
  Tab Delimited (TSV)   2D SDfile   Computed 3D by Vconf -m prep SDfile
Find this compound or compounds like it in BindingDB:
Activity Spreadsheet -- Enzyme Inhibition Constant Data from BindingDB
Found 1 hit for monomerid = 372282
TargetMuscarinic acetylcholine receptor M4(Homo sapiens (Human))
Vanderbilt University
US Patent
LigandPNGBDBM372282(8-(3,3-difluoroazetidin- 1-yl)-3,4-dimethylpyrimid...)
Affinity DataEC50:  426nM. Assay description: For high throughput measurement of agonist-evoked increases in intracellular calcium, CHO-K1 cells stably expressing muscarinic receptors were plated...
Ligand InfoPC cidPC sid
In DepthDetails US Patent