BDBM372305 8-chloro-N,N,7,9- tetramethyl-pyrido[3',2':4,5] furo[3,2-d]pyrimidin- 4-amine hydrochloride::US10239887, Cpd. No. 43
SMILES CN(C)c1ncnc2c1oc1nc(C)c(Cl)c(C)c21
InChI Key InChIKey=MBUKUGPROKSRMF-UHFFFAOYSA-N
Data  1 EC50
  Tab Delimited (TSV)   2D SDfile   Computed 3D by Vconf -m prep SDfile
Find this compound or compounds like it in BindingDB:
Activity Spreadsheet -- Enzyme Inhibition Constant Data from BindingDB
Found 1 hit for monomerid = 372305
TargetMuscarinic acetylcholine receptor M4(Homo sapiens (Human))
Vanderbilt University
US Patent
LigandPNGBDBM372305(8-chloro-N,N,7,9- tetramethyl-pyrido[3',2':4,5] fu...)
Affinity DataEC50:  1.39E+3nM. Assay description: For high throughput measurement of agonist-evoked increases in intracellular calcium, CHO-K1 cells stably expressing muscarinic receptors were plated...
Ligand InfoPC cidPC sid
In DepthDetails US Patent