BDBM372330 2-[3-[[(3,4- dimethylpyrimido [4',5':4,5]furo[2,3- c]pyridazin-8- yl)amino]methyl] phenyl]propan-2-ol::US10239887, Cpd. No. 67
SMILES Cc1nnc2oc3c(NCc4cccc(c4)C(C)(C)O)ncnc3c2c1C
InChI Key InChIKey=WKTWXXBUJIGOBB-UHFFFAOYSA-N
Data  1 EC50
  Tab Delimited (TSV)   2D SDfile   Computed 3D by Vconf -m prep SDfile
Find this compound or compounds like it in BindingDB:
Activity Spreadsheet -- Enzyme Inhibition Constant Data from BindingDB
Found 1 hit for monomerid = 372330
TargetMuscarinic acetylcholine receptor M4(Homo sapiens (Human))
Vanderbilt University
US Patent
LigandPNGBDBM372330(2-[3-[[(3,4- dimethylpyrimido [4',5':4,5]furo[2,3-...)
Affinity DataEC50:  1.70E+3nM. Assay description: For high throughput measurement of agonist-evoked increases in intracellular calcium, CHO-K1 cells stably expressing muscarinic receptors were plated...
Ligand InfoPC cidPC sid
In DepthDetails US Patent