BDBM372335 N-(3,3-difluorocyclobutyl)- 3,4-dimethyl-pyrimido [4',5':4,5]furo[2,3- c]pyridazin-8-amine::US10239887, Cpd. No. 72
SMILES Cc1nnc2oc3c(NC4CC(F)(F)C4)ncnc3c2c1C
InChI Key InChIKey=RZCMIYNSGSGGLB-UHFFFAOYSA-N
Data  1 EC50
  Tab Delimited (TSV)   2D SDfile   Computed 3D by Vconf -m prep SDfile
Find this compound or compounds like it in BindingDB:
Activity Spreadsheet -- Enzyme Inhibition Constant Data from BindingDB
Found 1 hit for monomerid = 372335
TargetMuscarinic acetylcholine receptor M4(Homo sapiens (Human))
Vanderbilt University
US Patent
LigandPNGBDBM372335(N-(3,3-difluorocyclobutyl)- 3,4-dimethyl-pyrimido ...)
Affinity DataEC50:  1.75E+3nM. Assay description: For high throughput measurement of agonist-evoked increases in intracellular calcium, CHO-K1 cells stably expressing muscarinic receptors were plated...
Ligand InfoPC cidPC sid
In DepthDetails US Patent