BDBM372374 Preparation of (S)-4-((1R,3aS,5aR,5bR,7aR,11aS,11bR,13aR,13bR)-3a-((2-(1,1-dioxidothiomorpholino)-2-oxoethyl)amino)-5a,5b,8,8,11a-pentamethyl-1-(prop-1-en-2-yl)-2,3,3a,4,5,5a,5b,6,7,7a,8,11,11a,11b,12,13,13a,13b-octadecahydro-1H-cyclopenta[a]chrysen-9-yl)-1-(fluoromethyl)cyclohex-3-enecarboxylic acid::US10245275, Example 29
SMILES CC(=C)[C@@H]1CC[C@@]2(CC[C@]3(C)[C@H](CC[C@@H]4[C@@]5(C)CC=C(C6=CC[C@@](CF)(CC6)C(O)=O)C(C)(C)[C@@H]5CC[C@@]34C)[C@@H]12)NCC(=O)N1CCS(=O)(=O)CC1
InChI Key InChIKey=TWNQJXQRFFMNLK-ISRNXWBBSA-N
Data  2 EC50
  Tab Delimited (TSV)   2D SDfile   Computed 3D by Vconf -m prep SDfile
Find this compound or compounds like it in BindingDB:
Activity Spreadsheet -- Enzyme Inhibition Constant Data from BindingDB
Found 2 hits for monomerid = 372374
TargetGag-Pol polyprotein [A364V](Human immunodeficiency virus type 1 group M subtyp...)
Viiv Healthcare UK (No. 4)
US Patent
LigandPNGBDBM372374(Preparation of (S)-4-((1R,3aS,5aR,5bR,7aR,11aS,11b...)
Affinity DataEC50: >50nM. Assay description: MT-2 cells and 293T cells were obtained from the NIH AIDS Research and Reference Reagent Program. MT-2 cells were propagated in RPMI 1640 media suppl...
Ligand InfoPC cidPC sid
In DepthDetails US Patent
TargetGag-Pol polyprotein(Human immunodeficiency virus type 1 group M subtyp...)
Viiv Healthcare UK (No. 4)
US Patent
LigandPNGBDBM372374(Preparation of (S)-4-((1R,3aS,5aR,5bR,7aR,11aS,11b...)
Affinity DataEC50: <50nM. Assay description: MT-2 cells and 293T cells were obtained from the NIH AIDS Research and Reference Reagent Program. MT-2 cells were propagated in RPMI 1640 media suppl...
Ligand InfoPC cidPC sid
In DepthDetails US Patent