BDBM372426 US10246419, Compound 9
SMILES CC(C)Cn1nc(cc1-c1ccc(cc1)-c1cccc(c1)S(C)(=O)=O)C(C)=C
InChI Key InChIKey=FIUSCDFFNFGFAZ-UHFFFAOYSA-N
Data  1 EC50
  Tab Delimited (TSV)   2D SDfile   Computed 3D by Vconf -m prep SDfile
Find this compound or compounds like it in BindingDB:
Activity Spreadsheet -- Enzyme Inhibition Constant Data from BindingDB
Found 1 hit for monomerid = 372426
TargetOxysterols receptor LXR-beta(Homo sapiens (Human))
Ralexar Therapeutics
US Patent
LigandPNGBDBM372426(US10246419, Compound 9)
Affinity DataEC50:  5.50E+3nM. Assay description: For transient transfection of HEK 293 cells, 6×103 cells are plated into 96-well dishes. Each well is transfected with 25 ng 5×UAS-luciferase reporte...
Ligand InfoPC cidPC sid
In DepthDetails US Patent