BDBM372431 1-(sec-butyl)-5-(3'- (methylsulfonyl)-[1,1'- biphenyl]-4-yl)-3- (trifluoromethyl)-1H- pyrazole::US10246419, Compound 19
SMILES CCC(C)n1nc(cc1-c1ccc(cc1)-c1cccc(c1)S(C)(=O)=O)C(F)(F)F
InChI Key InChIKey=DLOODBPNOCKXOA-UHFFFAOYSA-N
Data  1 EC50
  Tab Delimited (TSV)   2D SDfile   Computed 3D by Vconf -m prep SDfile
Find this compound or compounds like it in BindingDB:
Activity Spreadsheet -- Enzyme Inhibition Constant Data from BindingDB
Found 1 hit for monomerid = 372431
TargetOxysterols receptor LXR-beta(Homo sapiens (Human))
Ralexar Therapeutics
US Patent
LigandPNGBDBM372431(1-(sec-butyl)-5-(3'- (methylsulfonyl)-[1,1'- biphe...)
Affinity DataEC50: >1.00E+4nM. Assay description: For transient transfection of HEK 293 cells, 6×103 cells are plated into 96-well dishes. Each well is transfected with 25 ng 5×UAS-luciferase reporte...
Ligand InfoPC cidPC sid
In DepthDetails US Patent