BDBM372787 5-((Z)-2-(3-((1S,5S,6S)-3-amino-1-((R)-3-fluoropyrrolidine-1-carbonyl)-5-methyl-2-thia-4-azabicyclo[4.1.0]hept-3-en-5-yl)-4-fluorophenyl)-1-fluorovinyl)pyrazine-2-carbonitrile::US10246429, Example 203
SMILES C[C@@]1(N=C(N)S[C@]2(C[C@@H]12)C(=O)N1CC[C@@H](F)C1)c1cc(\C=C(/F)c2cnc(cn2)C#N)ccc1F
InChI Key InChIKey=KNQASGMYRYSFDQ-QHKJJCSPSA-N
Data  3 IC50
  Tab Delimited (TSV)   2D SDfile   Computed 3D by Vconf -m prep SDfile
Find this compound or compounds like it in BindingDB:
Activity Spreadsheet -- Enzyme Inhibition Constant Data from BindingDB
Found 3 hits for monomerid = 372787
TargetBeta-secretase 1(Homo sapiens (Human))
Amgen
US Patent
LigandPNGBDBM372787(5-((Z)-2-(3-((1S,5S,6S)-3-amino-1-((R)-3-fluoropyr...)
Affinity DataIC50:  1nM. Assay description: The cDNAs for both human recombinant BACE1 and 2 with C-terminal 6-His Tags were cloned into transient protein expression vectors, which were subsequ...
Ligand InfoPC cidPC sid
In DepthDetails US Patent
TargetCathepsin D(Homo sapiens (Human))
Amgen
US Patent
LigandPNGBDBM372787(5-((Z)-2-(3-((1S,5S,6S)-3-amino-1-((R)-3-fluoropyr...)
Affinity DataIC50:  4.77E+4nM. Assay description: Recombinant Cat D was expressed in CHO cells. The assay buffer for CatD is 0.05M citrate pH 3.5, 10% DMSO final, 5 mM CHAPS. The CatD enzyme (9 nM) i...
Ligand InfoPC cidPC sid
In DepthDetails US Patent
TargetBeta-secretase 2(Homo sapiens (Human))
Amgen
US Patent
LigandPNGBDBM372787(5-((Z)-2-(3-((1S,5S,6S)-3-amino-1-((R)-3-fluoropyr...)
Affinity DataIC50:  45nM
Ligand InfoPC cidPC sid
In DepthDetails US Patent