BDBM372833 (1S,5S,6S)-3-amino-5-(5-((Z)-2-(5-(but-2-yn-1-yloxy)pyrazin-2-yl)-2-fluorovinyl)-2-fluorophenyl)-5-methyl-2-thia-4-azabicyclo[4.1.0]hept-3-ene-1-carbonitrile::US10246429, Example 244
SMILES CC#CCOc1cnc(cn1)C(\F)=C\c1ccc(F)c(c1)[C@@]1(C)N=C(N)S[C@]2(C[C@@H]12)C#N
InChI Key InChIKey=IOARFOYMAGIOGC-PIGXPCJYSA-N
Data  3 IC50
  Tab Delimited (TSV)   2D SDfile   Computed 3D by Vconf -m prep SDfile
Find this compound or compounds like it in BindingDB:
Activity Spreadsheet -- Enzyme Inhibition Constant Data from BindingDB
Found 3 hits for monomerid = 372833
TargetBeta-secretase 1(Homo sapiens (Human))
Amgen
US Patent
LigandPNGBDBM372833((1S,5S,6S)-3-amino-5-(5-((Z)-2-(5-(but-2-yn-1-ylox...)
Affinity DataIC50:  0.400nM. Assay description: The cDNAs for both human recombinant BACE1 and 2 with C-terminal 6-His Tags were cloned into transient protein expression vectors, which were subsequ...
Ligand InfoPC cidPC sid
In DepthDetails US Patent
TargetCathepsin D(Homo sapiens (Human))
Amgen
US Patent
LigandPNGBDBM372833((1S,5S,6S)-3-amino-5-(5-((Z)-2-(5-(but-2-yn-1-ylox...)
Affinity DataIC50:  1.50E+5nM. Assay description: Recombinant Cat D was expressed in CHO cells. The assay buffer for CatD is 0.05M citrate pH 3.5, 10% DMSO final, 5 mM CHAPS. The CatD enzyme (9 nM) i...
Ligand InfoPC cidPC sid
In DepthDetails US Patent
TargetBeta-secretase 2(Homo sapiens (Human))
Amgen
US Patent
LigandPNGBDBM372833((1S,5S,6S)-3-amino-5-(5-((Z)-2-(5-(but-2-yn-1-ylox...)
Affinity DataIC50:  55nM
Ligand InfoPC cidPC sid
In DepthDetails US Patent