BDBM372998 US10597366, Compound 99::US9896418, Compound 99
SMILES FC(F)(F)S(=O)(=O)c1ccc(Oc2cccc(c2)C#N)c(Br)c1C#N
InChI Key InChIKey=WSQFVZRGMIUKOJ-UHFFFAOYSA-N
Data  1 IC50  3 EC50
  Tab Delimited (TSV)   2D SDfile   Computed 3D by Vconf -m prep SDfile
Find this compound or compounds like it in BindingDB:
Activity Spreadsheet -- Enzyme Inhibition Constant Data from BindingDB
Found 4 hits for monomerid = 372998
TargetVascular endothelial growth factor A(Homo sapiens (Human))
Peloton Therapeutics
US Patent
LigandPNGBDBM372998(US10597366, Compound 99 | US9896418, Compound 99)
Affinity DataEC50:  550nM. Assay description: Four hours later, serial dilutions of 10× compound stocks were made in growth medium from 500×DMSO stocks, and 20 μL of those 10× stocks were ad...
Ligand InfoPC cidPC sid
In DepthDetails US Patent
TargetVascular endothelial growth factor A(Homo sapiens (Human))
Peloton Therapeutics
US Patent
LigandPNGBDBM372998(US10597366, Compound 99 | US9896418, Compound 99)
Affinity DataEC50:  550nM. Assay description: VEGF: Four hours later, serial dilutions of 10x compound stocks were made in growth medium from 500xDMSO stocks, and 20 uL of those 10x stocks were a...
Ligand InfoPC cidPC sid
In DepthDetails US Patent
TargetEndothelial PAS domain-containing protein 1(Homo sapiens (Human))
Peloton Therapeutics
US Patent
LigandPNGBDBM372998(US10597366, Compound 99 | US9896418, Compound 99)
Affinity DataIC50:  170nM. Assay description: HIF-2a: The total assay volume was about 100 uL in the following configuration: 2 uL compound in 100% DMSO, 88 uL buffer with protein and probe and 1...
Ligand InfoPC cidPC sid
In DepthDetails US Patent
TargetVascular endothelial growth factor A(Homo sapiens (Human))
Peloton Therapeutics
US Patent
LigandPNGBDBM372998(US10597366, Compound 99 | US9896418, Compound 99)
Affinity DataEC50:  550nM. Assay description: About 7500 of 786-0 cells in 180 μL of growth medium were seeded into each well of a 96 well plate with white clear bottom on the first day (07-...
Ligand InfoPC cidPC sid
In DepthDetails US Patent