BDBM373000 US10597366, Compound 124::US9896418, Compound 124
SMILES FC(F)c1cc(ccc1Oc1cc(F)cc(Cl)c1)S(=O)(=O)C(F)(F)F
InChI Key InChIKey=YFYNWXCRDHBCSY-UHFFFAOYSA-N
Data  2 IC50  4 EC50
  Tab Delimited (TSV)   2D SDfile   Computed 3D by Vconf -m prep SDfile
Find this compound or compounds like it in BindingDB:
Activity Spreadsheet -- Enzyme Inhibition Constant Data from BindingDB
Found 6 hits for monomerid = 373000
TargetVascular endothelial growth factor A(Homo sapiens (Human))
Peloton Therapeutics
US Patent
LigandPNGBDBM373000(US10597366, Compound 124 | US9896418, Compound 124)
Affinity DataEC50:  400nM. Assay description: Four hours later, serial dilutions of 10× compound stocks were made in growth medium from 500×DMSO stocks, and 20 μL of those 10× stocks were ad...
Ligand InfoPC cidPC sid
In DepthDetails US Patent
TargetVascular endothelial growth factor A(Homo sapiens (Human))
Peloton Therapeutics
US Patent
LigandPNGBDBM373000(US10597366, Compound 124 | US9896418, Compound 124)
Affinity DataEC50:  400nM. Assay description: About 7500 of 786-0 cells in 180 μL of growth medium were seeded into each well of a 96 well plate with white clear bottom on the first day (07-...
Ligand InfoPC cidPC sid
In DepthDetails US Patent
TargetVascular endothelial growth factor A(Homo sapiens (Human))
Peloton Therapeutics
US Patent
LigandPNGBDBM373000(US10597366, Compound 124 | US9896418, Compound 124)
Affinity DataEC50:  400nM. Assay description: VEGF: Four hours later, serial dilutions of 10x compound stocks were made in growth medium from 500xDMSO stocks, and 20 uL of those 10x stocks were a...
Ligand InfoPC cidPC sid
In DepthDetails US Patent
TargetEndothelial PAS domain-containing protein 1(Homo sapiens (Human))
Peloton Therapeutics
Curated by ChEMBL
LigandPNGBDBM373000(US10597366, Compound 124 | US9896418, Compound 124)
Affinity DataEC50:  240nM. Assay description: Antagonist activity at HIF-2alpha in human 786-O cells co-expressing HIF responsive element after 24 hrs by ONE-Glo luciferase reporter gene assay
Ligand InfoPC cidPC sid
In DepthDetails ArticlePubMed
TargetEndothelial PAS domain-containing protein 1(Homo sapiens (Human))
Peloton Therapeutics
Curated by ChEMBL
LigandPNGBDBM373000(US10597366, Compound 124 | US9896418, Compound 124)
Affinity DataIC50:  38nM. Assay description: HIF-2a: The total assay volume was about 100 uL in the following configuration: 2 uL compound in 100% DMSO, 88 uL buffer with protein and probe and 1...
Ligand InfoPC cidPC sid
In DepthDetails US Patent
TargetEndothelial PAS domain-containing protein 1(Homo sapiens (Human))
Peloton Therapeutics
Curated by ChEMBL
LigandPNGBDBM373000(US10597366, Compound 124 | US9896418, Compound 124)
Affinity DataIC50:  220nM. Assay description: Binding affinity to His-tagged HIF-2alpha PAS-B domain (unknown origin) after 2 hrs by scintillation proximity assay
Ligand InfoPC cidPC sid
In DepthDetails ArticlePubMed