BDBM373039 US10597366, Compound 274::US9896418, Compound 274
SMILES O[C@H]1c2c(CC1(F)F)c(Oc1cc(F)cc(c1)C#N)ccc2S(=N)(=O)CF
InChI Key InChIKey=ADHRUTMLOXOEGC-CJKOFORZSA-N
Data  2 IC50  3 EC50
  Tab Delimited (TSV)   2D SDfile   Computed 3D by Vconf -m prep SDfile
Find this compound or compounds like it in BindingDB:
Activity Spreadsheet -- Enzyme Inhibition Constant Data from BindingDB
Found 5 hits for monomerid = 373039
TargetVascular endothelial growth factor A(Homo sapiens (Human))
Peloton Therapeutics
US Patent
LigandPNGBDBM373039(US10597366, Compound 274 | US9896418, Compound 274)
Affinity DataEC50:  1.44E+3nM. Assay description: Four hours later, serial dilutions of 10× compound stocks were made in growth medium from 500×DMSO stocks, and 20 μL of those 10× stocks were ad...
Ligand InfoPC cidPC sid
In DepthDetails US Patent
TargetVascular endothelial growth factor A(Homo sapiens (Human))
Peloton Therapeutics
US Patent
LigandPNGBDBM373039(US10597366, Compound 274 | US9896418, Compound 274)
Affinity DataEC50:  1.44E+3nM. Assay description: About 7500 of 786-0 cells in 180 μL of growth medium were seeded into each well of a 96 well plate with white clear bottom on the first day (07-...
Ligand InfoPC cidPC sid
In DepthDetails US Patent
TargetVascular endothelial growth factor A(Homo sapiens (Human))
Peloton Therapeutics
US Patent
LigandPNGBDBM373039(US10597366, Compound 274 | US9896418, Compound 274)
Affinity DataEC50:  1.44E+3nM. Assay description: VEGF: Four hours later, serial dilutions of 10x compound stocks were made in growth medium from 500xDMSO stocks, and 20 uL of those 10x stocks were a...
Ligand InfoPC cidPC sid
In DepthDetails US Patent
TargetEndothelial PAS domain-containing protein 1(Homo sapiens (Human))
Peloton Therapeutics
US Patent
LigandPNGBDBM373039(US10597366, Compound 274 | US9896418, Compound 274)
Affinity DataIC50:  76nM. Assay description: HIF-2a: The total assay volume was about 100 uL in the following configuration: 2 uL compound in 100% DMSO, 88 uL buffer with protein and probe and 1...
Ligand InfoPC cidPC sid
In DepthDetails US Patent
TargetEndothelial PAS domain-containing protein 1(Homo sapiens (Human))
Peloton Therapeutics
US Patent
LigandPNGBDBM373039(US10597366, Compound 274 | US9896418, Compound 274)
Affinity DataIC50:  94nM. Assay description: HIF-2a: The total assay volume was about 100 uL in the following configuration: 2 uL compound in 100% DMSO, 88 uL buffer with protein and probe and 1...
Ligand InfoPC cidPC sid
In DepthDetails US Patent