BDBM373076 US9896435, Example 24
SMILES COCCN1CC(NC(=O)Nc2c(C)c(nn2-c2ccccc2)-c2ccc(=O)n(C)c2)[C@@H](C1)c1cc(F)cc(Cl)c1
InChI Key InChIKey=HZBNQIBPVYMQMJ-PMCHYTPCSA-N
Data  1 IC50
  Tab Delimited (TSV)   2D SDfile   Computed 3D by Vconf -m prep SDfile
Find this compound or compounds like it in BindingDB:
Activity Spreadsheet -- Enzyme Inhibition Constant Data from BindingDB
Found 1 hit for monomerid = 373076
TargetHigh affinity nerve growth factor receptor(Homo sapiens (Human))
Array Biopharma
US Patent
LigandPNGBDBM373076(US9896435, Example 24)
Affinity DataIC50: <100nM. Assay description: TrkA binding activity was determined in a TrkA LanthaScreen™ Eu Kinase Binding Assay. 5 nM His-tagged recombinant human TrkA (6HIS tagged cytoplasmic...
Ligand InfoPC cidPC sid
In DepthDetails US Patent