BDBM373137 US9896452, Example 2::rac-N-((5-fluoro-1-(2-methyl-5-phenylthiazole-4-carbonyl)piperidin-2-yl)methyl)benzofuran-4-carboxamide
SMILES Cc1nc(C(=O)N2CC(F)CCC2CNC(=O)c2cccc3occc23)c(s1)-c1ccccc1
InChI Key InChIKey=MOXXGRCLAOBXLS-UHFFFAOYSA-N
Data  2 IC50
  Tab Delimited (TSV)   2D SDfile   Computed 3D by Vconf -m prep SDfile
Find this compound or compounds like it in BindingDB:
Activity Spreadsheet -- Enzyme Inhibition Constant Data from BindingDB
Found 2 hits for monomerid = 373137
TargetOrexin receptor type 2(Homo sapiens (Human))
Eolas Therapeutics
US Patent
LigandPNGBDBM373137(US9896452, Example 2 | rac-N-((5-fluoro-1-(2-methy...)
Affinity DataIC50:  7nM. Assay description: Measurement of [Ca2+]i using a FLIPR: CHO-OX1 or CHO-OX2 cells are seeded into black-walled clear-base 384-well plates (Costar) at a density of 20,00...
Ligand InfoPC cidPC sid
In DepthDetails US Patent
TargetOrexin/Hypocretin receptor type 1(Homo sapiens (Human))
Eolas Therapeutics
US Patent
LigandPNGBDBM373137(US9896452, Example 2 | rac-N-((5-fluoro-1-(2-methy...)
Affinity DataIC50:  1nM. Assay description: Measurement of [Ca2+]i using a FLIPR: CHO-OX1 or CHO-OX2 cells are seeded into black-walled clear-base 384-well plates (Costar) at a density of 20,00...
Ligand InfoPC cidPC sid
In DepthDetails US Patent