BDBM373200 US9896452, Example 60::rac-3-Fluoro-N-((1-(5-(4-fluorophenyl)-2-methylthiazole-4-carbonyl)-6-methylpiperidin-2-yl)methyl)-2-methoxybenzamide
SMILES COc1c(F)cccc1C(=O)NCC1CCCC(C)N1C(=O)c1nc(C)sc1-c1ccc(F)cc1
InChI Key InChIKey=BJMYJAPKIHPIPW-UHFFFAOYSA-N
Data  2 IC50
  Tab Delimited (TSV)   2D SDfile   Computed 3D by Vconf -m prep SDfile
Find this compound or compounds like it in BindingDB:
Activity Spreadsheet -- Enzyme Inhibition Constant Data from BindingDB
Found 2 hits for monomerid = 373200
TargetOrexin receptor type 2(Homo sapiens (Human))
Eolas Therapeutics
US Patent
LigandPNGBDBM373200(US9896452, Example 60 | rac-3-Fluoro-N-((1-(5-(4-f...)
Affinity DataIC50:  370nM. Assay description: Measurement of [Ca2+]i using a FLIPR: CHO-OX1 or CHO-OX2 cells are seeded into black-walled clear-base 384-well plates (Costar) at a density of 20,00...
Ligand InfoPC cidPC sid
In DepthDetails US Patent
TargetOrexin/Hypocretin receptor type 1(Homo sapiens (Human))
Eolas Therapeutics
US Patent
LigandPNGBDBM373200(US9896452, Example 60 | rac-3-Fluoro-N-((1-(5-(4-f...)
Affinity DataIC50:  1nM. Assay description: Measurement of [Ca2+]i using a FLIPR: CHO-OX1 or CHO-OX2 cells are seeded into black-walled clear-base 384-well plates (Costar) at a density of 20,00...
Ligand InfoPC cidPC sid
In DepthDetails US Patent