BDBM373241 US9896452, Example 104::rac-((2S,3R)-3-methyl-2-(((5-(trifluoromethyl)pyridin-2-yl)amino)methyl)piperidin-1-yl)(5-methyl-2-(pyridin-3-yl)phenyl)methanone
SMILES C[C@@H]1CCCN([C@@H]1CNc1ccc(cn1)C(F)(F)F)C(=O)c1cc(C)ccc1-c1cccnc1
InChI Key InChIKey=YCUVBKNJESOATO-WZONZLPQSA-N
Data  2 IC50
  Tab Delimited (TSV)   2D SDfile   Computed 3D by Vconf -m prep SDfile
Find this compound or compounds like it in BindingDB:
Activity Spreadsheet -- Enzyme Inhibition Constant Data from BindingDB
Found 2 hits for monomerid = 373241
TargetOrexin receptor type 2(Homo sapiens (Human))
Eolas Therapeutics
US Patent
LigandPNGBDBM373241(US9896452, Example 104 | rac-((2S,3R)-3-methyl-2-(...)
Affinity DataIC50:  8.80E+3nM. Assay description: Measurement of [Ca2+]i using a FLIPR: CHO-OX1 or CHO-OX2 cells are seeded into black-walled clear-base 384-well plates (Costar) at a density of 20,00...
Ligand InfoPC cidPC sid
In DepthDetails US Patent
TargetOrexin/Hypocretin receptor type 1(Homo sapiens (Human))
Eolas Therapeutics
US Patent
LigandPNGBDBM373241(US9896452, Example 104 | rac-((2S,3R)-3-methyl-2-(...)
Affinity DataIC50:  1nM. Assay description: Measurement of [Ca2+]i using a FLIPR: CHO-OX1 or CHO-OX2 cells are seeded into black-walled clear-base 384-well plates (Costar) at a density of 20,00...
Ligand InfoPC cidPC sid
In DepthDetails US Patent