BDBM373262 FD-2013031::US9902709, Compound Example 6
SMILES Cn1cc(cn1)-c1nccc(Oc2ccc(NC(=O)Nc3ccc(Cl)c(c3)C(F)(F)F)cc2)c1N
InChI Key InChIKey=KCUAYVYWUKSJHN-UHFFFAOYSA-N
Data  1 IC50
  Tab Delimited (TSV)   2D SDfile   Computed 3D by Vconf -m prep SDfile
Find this compound or compounds like it in BindingDB:
Activity Spreadsheet -- Enzyme Inhibition Constant Data from BindingDB
Found 1 hit for monomerid = 373262
TargetVascular endothelial growth factor receptor 2(Homo sapiens (Human))
Peking University Founder Group
US Patent
LigandPNGBDBM373262(FD-2013031 | US9902709, Compound Example 6)
Affinity DataIC50:  215nM. Assay description: Kinase Enzymatic step assay Control (10 μL) Sample Negative Positive Compound 4 μL 4 μL 2.5% 4 μL 2.5% DMSO/kinase DMSO/kinase bu...
Ligand InfoPC cidPC sid
In DepthDetails US Patent