BDBM373529 US9902726, Compound 8
SMILES CN1CC[C@]23Cc4[nH]c(=O)c(cc4C[C@@]2(O)[C@H]1Cc1ccc(O)cc31)S(=O)(=O)c1ccccc1
InChI Key InChIKey=VSJLKDCPGIHPBR-LGPLSSKUSA-N
Data  1 KI
  Tab Delimited (TSV)   2D SDfile   Computed 3D by Vconf -m prep SDfile
Find this compound or compounds like it in BindingDB:
Activity Spreadsheet -- Enzyme Inhibition Constant Data from BindingDB
Found 1 hit for monomerid = 373529
TargetKappa-type opioid receptor(Homo sapiens (Human))
Purdue Pharma
US Patent
LigandPNGBDBM373529(US9902726, Compound 8)
Affinity DataKi:  1.95E+4nM. Assay description: κ-Opioid: Radioligand dose displacement assays used 0.4 nM [3H]-U69,593 (GE Healthcare, Piscataway, N.J.; 40 Ci/mmole) with 15 μg membrane ...
Ligand InfoPC cidPC sid
In DepthDetails US Patent