BDBM37353 2-[[5-[(2-chloroanilino)methyl]-4-ethyl-1,2,4-triazol-3-yl]thio]-N-(phenylmethyl)acetamide::2-[[5-[[(2-chlorophenyl)amino]methyl]-4-ethyl-1,2,4-triazol-3-yl]sulfanyl]-N-(phenylmethyl)ethanamide::MLS000031654::N-Benzyl-2-{5-[(2-chloro-phenylamino)-methyl]-4-ethyl-4H-[1,2,4]triazol-3-ylsulfanyl}-acetamide::N-benzyl-2-[[5-[(2-chloroanilino)methyl]-4-ethyl-1,2,4-triazol-3-yl]sulfanyl]acetamide::N-benzyl-2-[[5-[(2-chloroanilino)methyl]-4-ethyl-1,2,4-triazol-3-yl]thio]acetamide::SMR000011441::cid_646854
SMILES CCn1c(CNc2ccccc2Cl)nnc1SCC(=O)NCc1ccccc1
InChI Key InChIKey=TVFDHWDRLKHUCB-UHFFFAOYSA-N
Data  1 IC50
  Tab Delimited (TSV)   2D SDfile   Computed 3D by Vconf -m prep SDfile
Find this compound or compounds like it in BindingDB:
Activity Spreadsheet -- Enzyme Inhibition Constant Data from BindingDB
Found 1 hit for monomerid = 37353
TargetSphingosine 1-phosphate receptor 3(Homo sapiens (Human))
The Scripps Research Institute Molecular Screening Center
Curated by PubChem BioAssay
LigandPNGBDBM37353(2-[[5-[(2-chloroanilino)methyl]-4-ethyl-1,2,4-tria...)
Affinity DataIC50: >4.98E+4nM. Assay description: Source (MLSCN Center Name): The Scripps Research Institute Molecular Screening Center Center Affiliation: The Scripps Research Institute, TSRI Assay ...
In DepthDetails PCBioAssay