BDBM373593 1-(4-Cyanamido-6-phenylquinazolin-2-yl)-1H-pyrazole-4-carboxylic acid;::US10246442, Example 50::US10975062, Example 50
SMILES OC(=O)c1cnn(c1)-c1nc(NC#N)c2cc(ccc2n1)-c1ccccc1
InChI Key InChIKey=JLOXTSVAMJBUJJ-UHFFFAOYSA-N
Data  2 IC50
  Tab Delimited (TSV)   2D SDfile   Computed 3D by Vconf -m prep SDfile
Find this compound or compounds like it in BindingDB:
Activity Spreadsheet -- Enzyme Inhibition Constant Data from BindingDB
Found 2 hits for monomerid = 373593
TargetEgl nine homolog 1 [181-417](Homo sapiens (Human))
TBA
US Patent
LigandPNGBDBM373593(1-(4-Cyanamido-6-phenylquinazolin-2-yl)-1H-pyrazol...)
Affinity DataIC50:  79.4nM. Assay description: The PHD enzymatic assay was performed in 0.5 ml of reaction mixture containing the following: purified PHD2181-417 polypeptide (3 μg), synthetic...
Ligand InfoPC cidPC sid
In DepthDetails US Patent
TargetEgl nine homolog 1 [182-426](Homo sapiens (Human))
Janssen Pharmaceutica
US Patent
LigandPNGBDBM373593(1-(4-Cyanamido-6-phenylquinazolin-2-yl)-1H-pyrazol...)
Affinity DataIC50:  79.4nM. Assay description: The PHD enzymatic assay was performed in 0.5 ml of reaction mixture containing the following: purified PHD2181-417 polypeptide (3 μg), synthetic...
Ligand InfoPC cidPC sid
In DepthDetails US Patent