BDBM373620 1-(4-(tert-Butylamino)-6-phenoxyquinazolin-2-yl)-1H-pyrazole-4-carboxylicacid;::US10246442, Example 72::US10975062, Example 72
SMILES CC(C)(C)Nc1nc(nc2ccc(Oc3ccccc3)cc12)-n1cc(cn1)C(O)=O
InChI Key InChIKey=GBNHJLIDYLEXJQ-UHFFFAOYSA-N
Data  2 IC50
  Tab Delimited (TSV)   2D SDfile   Computed 3D by Vconf -m prep SDfile
Find this compound or compounds like it in BindingDB:
Activity Spreadsheet -- Enzyme Inhibition Constant Data from BindingDB
Found 2 hits for monomerid = 373620
TargetEgl nine homolog 1 [181-417](Homo sapiens (Human))
TBA
US Patent
LigandPNGBDBM373620(1-(4-(tert-Butylamino)-6-phenoxyquinazolin-2-yl)-1...)
Affinity DataIC50:  200nM. Assay description: The PHD enzymatic assay was performed in 0.5 ml of reaction mixture containing the following: purified PHD2181-417 polypeptide (3 μg), synthetic...
Ligand InfoPC cidPC sid
In DepthDetails US Patent
TargetEgl nine homolog 1 [182-426](Homo sapiens (Human))
Janssen Pharmaceutica
US Patent
LigandPNGBDBM373620(1-(4-(tert-Butylamino)-6-phenoxyquinazolin-2-yl)-1...)
Affinity DataIC50:  200nM. Assay description: The PHD enzymatic assay was performed in 0.5 ml of reaction mixture containing the following: purified PHD2181-417 polypeptide (3 μg), synthetic...
Ligand InfoPC cidPC sid
In DepthDetails US Patent