BDBM373835 (S)-4-((1-benzylpyrrolidin-3-yl)(methyl)amino)-3-chloro-2,6-difluoro-N-(thiazol-4-yl)benzenesulfonamide formate::US10246453, Example 102::US10662184, Example 102::US11299490, Example 102
SMILES CN(C1CCN(Cc2ccccc2)C1)c1cc(F)c(c(F)c1Cl)S(=O)(=O)Nc1cscn1
InChI Key InChIKey=KDBCNDYXFRQBOP-UHFFFAOYSA-N
Data  9 IC50
  Tab Delimited (TSV)   2D SDfile   Computed 3D by Vconf -m prep SDfile
Find this compound or compounds like it in BindingDB:
Activity Spreadsheet -- Enzyme Inhibition Constant Data from BindingDB
Found 9 hits for monomerid = 373835
TargetSodium channel protein type 8 subunit alpha(Homo sapiens (Human))
Xenon Pharmaceuticals
US Patent
LigandPNGBDBM373835((S)-4-((1-benzylpyrrolidin-3-yl)(methyl)amino)-3-c...)
Affinity DataIC50:  703nM. Assay description: This sodium influx assay employs the use of the cell permeable, sodium sensitive dye ANG2 to quantify sodium ion influx through sodium channels which...
Ligand InfoPC cidPC sid
In DepthDetails US Patent
TargetSodium channel protein type 5 subunit alpha(Homo sapiens (Human))
Xenon Pharmaceuticals
US Patent
LigandPNGBDBM373835((S)-4-((1-benzylpyrrolidin-3-yl)(methyl)amino)-3-c...)
Affinity DataIC50: >3.00E+4nM. Assay description: This sodium influx assay employs the use of the cell permeable, sodium sensitive dye ANG2 to quantify sodium ion influx through sodium channels which...
Ligand InfoPC cidPC sid
In DepthDetails US Patent
TargetSodium channel protein type 1 subunit alpha(Homo sapiens (Human))
Xenon Pharmaceuticals
US Patent
LigandPNGBDBM373835((S)-4-((1-benzylpyrrolidin-3-yl)(methyl)amino)-3-c...)
Affinity DataIC50: >3.00E+4nM. Assay description: This sodium influx assay employs the use of the cell permeable, sodium sensitive dye ANG2 to quantify sodium ion influx through sodium channels which...
Ligand InfoPC cidPC sid
In DepthDetails US Patent
TargetSodium channel protein type 8 subunit alpha(Homo sapiens (Human))
Xenon Pharmaceuticals
US Patent
LigandPNGBDBM373835((S)-4-((1-benzylpyrrolidin-3-yl)(methyl)amino)-3-c...)
Affinity DataIC50:  152nM. Assay description: Patch voltage clamp electrophysiology allows for the direct measurement and quantification of block of voltage-gated sodium channels (Nay's), and...
Ligand InfoPC cidPC sid
In DepthDetails US Patent
TargetSodium channel protein type 1 subunit alpha(Homo sapiens (Human))
Xenon Pharmaceuticals
US Patent
LigandPNGBDBM373835((S)-4-((1-benzylpyrrolidin-3-yl)(methyl)amino)-3-c...)
Affinity DataIC50: >1.00E+4nM. Assay description: Sodium currents were measured using the patch clamp technique in the whole-cell configuration using either a PatchXpress automated voltage clamp or m...
Ligand InfoPC cidPC sid
In DepthDetails US Patent
TargetSodium channel protein type 8 subunit alpha(Homo sapiens (Human))
Xenon Pharmaceuticals
US Patent
LigandPNGBDBM373835((S)-4-((1-benzylpyrrolidin-3-yl)(methyl)amino)-3-c...)
Affinity DataIC50:  152nM. Assay description: The following patch voltage clamp electrophysiology studies were performed on representative compounds of the invention using human embryonic kidney ...
Ligand InfoPC cidPC sid
In DepthDetails US Patent
TargetSodium channel protein type 1 subunit alpha(Homo sapiens (Human))
Xenon Pharmaceuticals
US Patent
LigandPNGBDBM373835((S)-4-((1-benzylpyrrolidin-3-yl)(methyl)amino)-3-c...)
Affinity DataIC50: >1.00E+4nM. Assay description: The following patch voltage clamp electrophysiology studies were performed on representative compounds of the invention using human embryonic kidney ...
Ligand InfoPC cidPC sid
In DepthDetails US Patent
TargetSodium channel protein type 8 subunit alpha(Homo sapiens (Human))
Xenon Pharmaceuticals
US Patent
LigandPNGBDBM373835((S)-4-((1-benzylpyrrolidin-3-yl)(methyl)amino)-3-c...)
Affinity DataIC50:  152nM. Assay description: Sodium currents were measured using the patch clamp technique in the whole-cell configuration using either a PatchXpress automated voltage clamp or m...
Ligand InfoPC cidPC sid
In DepthDetails US Patent
TargetSodium channel protein type 1 subunit alpha(Homo sapiens (Human))
Xenon Pharmaceuticals
US Patent
LigandPNGBDBM373835((S)-4-((1-benzylpyrrolidin-3-yl)(methyl)amino)-3-c...)
Affinity DataIC50: >1.00E+4nM. Assay description: Patch voltage clamp electrophysiology allows for the direct measurement and quantification of block of voltage-gated sodium channels (Nay's), and...
Ligand InfoPC cidPC sid
In DepthDetails US Patent