BDBM374070 2-(6-(5-aminopyridin-3-yl)-1H-indazol-1-yl)pyrimidine-4-carbonitrile::US10246456, Example 37::US10577367, Example 37
SMILES Nc1cncc(c1)-c1ccc2cnn(-c3nccc(n3)C#N)c2c1
InChI Key InChIKey=DHOBZAXYKLVFRZ-UHFFFAOYSA-N
Data  2 IC50
  Tab Delimited (TSV)   2D SDfile   Computed 3D by Vconf -m prep SDfile
Find this compound or compounds like it in BindingDB:
Activity Spreadsheet -- Enzyme Inhibition Constant Data from BindingDB
Found 2 hits for monomerid = 374070
TargetInterleukin-1 receptor-associated kinase 4(Homo sapiens (Human))
Biogen Ma
US Patent
LigandPNGBDBM374070(2-(6-(5-aminopyridin-3-yl)-1H-indazol-1-yl)pyrimid...)
Affinity DataIC50: <100nM. Assay description: The biochemical assay is in a AlphaScreen format. The kinase reaction is based on the IRAK-4 phosphorylation of a biotin labeled peptide. The phospho...
Ligand InfoPC cidPC sid
In DepthDetails US Patent
TargetInterleukin-1 receptor-associated kinase 4(Homo sapiens (Human))
Biogen Ma
US Patent
LigandPNGBDBM374070(2-(6-(5-aminopyridin-3-yl)-1H-indazol-1-yl)pyrimid...)
Affinity DataIC50: <100nM. Assay description: The biochemical assay is in a AlphaScreen format. The kinase reaction is based on the IRAK-4 phosphorylation of a biotin labeled peptide. The phospho...
Ligand InfoPC cidPC sid
In DepthDetails US Patent