BDBM37447 2-{[4-ethyl-5-({[(4-methoxyphenyl)acetyl]amino}methyl)-4H-1,2,4-triazol-3-yl]thio}-N-1,3-thiazol-2-ylacetamide::MLS000088889::N-[[4-ethyl-5-[2-oxidanylidene-2-(1,3-thiazol-2-ylamino)ethyl]sulfanyl-1,2,4-triazol-3-yl]methyl]-2-(4-methoxyphenyl)ethanamide::N-[[4-ethyl-5-[2-oxo-2-(1,3-thiazol-2-ylamino)ethyl]sulfanyl-1,2,4-triazol-3-yl]methyl]-2-(4-methoxyphenyl)acetamide::N-[[4-ethyl-5-[[2-keto-2-(thiazol-2-ylamino)ethyl]thio]-1,2,4-triazol-3-yl]methyl]-2-(4-methoxyphenyl)acetamide::N-[[4-ethyl-5-[[2-oxo-2-(2-thiazolylamino)ethyl]thio]-1,2,4-triazol-3-yl]methyl]-2-(4-methoxyphenyl)acetamide::SMR000073074::cid_1797285
SMILES CCn1c(CNC(=O)Cc2ccc(OC)cc2)nnc1SCC(=O)Nc1nccs1
InChI Key InChIKey=COHNMBGFMAIMOW-UHFFFAOYSA-N
Data  1 IC50
  Tab Delimited (TSV)   2D SDfile   Computed 3D by Vconf -m prep SDfile
Find this compound or compounds like it in BindingDB:
Activity Spreadsheet -- Enzyme Inhibition Constant Data from BindingDB
Found 1 hit for monomerid = 37447
TargetSphingosine 1-phosphate receptor 3(Homo sapiens (Human))
The Scripps Research Institute Molecular Screening Center
Curated by PubChem BioAssay
LigandPNGBDBM37447(2-{[4-ethyl-5-({[(4-methoxyphenyl)acetyl]amino}met...)
Affinity DataIC50: >4.98E+4nM. Assay description: Source (MLSCN Center Name): The Scripps Research Institute Molecular Screening Center Center Affiliation: The Scripps Research Institute, TSRI Assay ...
In DepthDetails PCBioAssay