BDBM37456 6-cyclopropyl-2-keto-4-(trifluoromethyl)-1H-pyridine-3-carbonitrile::6-cyclopropyl-2-oxidanylidene-4-(trifluoromethyl)-1H-pyridine-3-carbonitrile::6-cyclopropyl-2-oxo-4-(trifluoromethyl)-1H-pyridine-3-carbonitrile::MLS000116980::SMR000093934::cid_4302841
SMILES FC(F)(F)c1cc([nH]c(=O)c1C#N)C1CC1
InChI Key InChIKey=ZCDZVNUZVPVCST-UHFFFAOYSA-N
Data  2 IC50
  Tab Delimited (TSV)   2D SDfile   Computed 3D by Vconf -m prep SDfile
Find this compound or compounds like it in BindingDB:
Activity Spreadsheet -- Enzyme Inhibition Constant Data from BindingDB
Found 2 hits for monomerid = 37456
TargetdTDP-4-dehydrorhamnose 3,5-epimerase(Mycobacterium tuberculosis H37Rv)
Pcmd
Curated by PubChem BioAssay
LigandPNGBDBM37456(6-cyclopropyl-2-keto-4-(trifluoromethyl)-1H-pyridi...)
Affinity DataIC50:  6.35E+3nM. Assay description: Molecular Library Screening Center Network (MLSCN) Penn Center for Molecular Discovery (PCMD) Assay Provider: Michael McNeil, Colorado State Universi...
In DepthDetails PCBioAssay
TargetSphingosine 1-phosphate receptor 3(Homo sapiens (Human))
The Scripps Research Institute Molecular Screening Center
Curated by PubChem BioAssay
LigandPNGBDBM37456(6-cyclopropyl-2-keto-4-(trifluoromethyl)-1H-pyridi...)
Affinity DataIC50: >4.98E+4nM. Assay description: Source (MLSCN Center Name): The Scripps Research Institute Molecular Screening Center Center Affiliation: The Scripps Research Institute, TSRI Assay ...
In DepthDetails PCBioAssay