BDBM374593 2-[3-(3-amino-6-methyl-1H-indazol-5-yl)-2-(hydroxymethyl)phenyl]-6-tert-butyl-8-fluorophthalazin-1(2H)-one::US10246457, Example 2
SMILES Cc1cc2[nH]nc(N)c2cc1-c1cccc(c1CO)-n1ncc2cc(cc(F)c2c1=O)C(C)(C)C
InChI Key InChIKey=UWLJBRGGXIOYRX-UHFFFAOYSA-N
Data  2 IC50
  Tab Delimited (TSV)   2D SDfile   Computed 3D by Vconf -m prep SDfile
Find this compound or compounds like it in BindingDB:
Activity Spreadsheet -- Enzyme Inhibition Constant Data from BindingDB
Found 2 hits for monomerid = 374593
TargetTyrosine-protein kinase BTK(Homo sapiens (Human))
Merck Sharp & Dohme
US Patent
LigandPNGBDBM374593(2-[3-(3-amino-6-methyl-1H-indazol-5-yl)-2-(hydroxy...)
Affinity DataIC50:  341nM. Assay description: Btk enzymatic activity was determined with the LANCE (Lanthanide Chelate Excite) TR-FRET (lime-resolved fluorescence resonance energy transfer) assay...
Ligand InfoPC cidPC sid
In DepthDetails US Patent
TargetTyrosine-protein kinase BTK(Homo sapiens (Human))
Merck Sharp & Dohme
US Patent
LigandPNGBDBM374593(2-[3-(3-amino-6-methyl-1H-indazol-5-yl)-2-(hydroxy...)
Affinity DataIC50:  10.9nM. Assay description: Btk enzymatic activity was determined with the LANCE (Lanthanide Chelate Excite) TR-FRET (lime-resolved fluorescence resonance energy transfer) assay...
Ligand InfoPC cidPC sid
In DepthDetails US Patent