BDBM374600 2-{3-[3-amino-7-(1-methyl-1H-pyrazol-4-yl)-1H-indazol-5-yl]-2-(hydroxymethyl)phenyl}-6-tert-butyl-8-fluorophthalazin-1(2H)-one::US10246457, Example 9
SMILES Cn1cc(cn1)-c1cc(cc2c(N)n[nH]c12)-c1cccc(c1CO)-n1ncc2cc(cc(F)c2c1=O)C(C)(C)C
InChI Key InChIKey=AEAGPFXCSWTPSP-UHFFFAOYSA-N
Data  2 IC50
  Tab Delimited (TSV)   2D SDfile   Computed 3D by Vconf -m prep SDfile
Find this compound or compounds like it in BindingDB:
Activity Spreadsheet -- Enzyme Inhibition Constant Data from BindingDB
Found 2 hits for monomerid = 374600
TargetTyrosine-protein kinase BTK(Homo sapiens (Human))
Merck Sharp & Dohme
US Patent
LigandPNGBDBM374600(2-{3-[3-amino-7-(1-methyl-1H-pyrazol-4-yl)-1H-inda...)
Affinity DataIC50:  5.30nM. Assay description: Btk enzymatic activity was determined with the LANCE (Lanthanide Chelate Excite) TR-FRET (lime-resolved fluorescence resonance energy transfer) assay...
Ligand InfoPC cidPC sid
In DepthDetails US Patent
TargetTyrosine-protein kinase BTK(Homo sapiens (Human))
Merck Sharp & Dohme
US Patent
LigandPNGBDBM374600(2-{3-[3-amino-7-(1-methyl-1H-pyrazol-4-yl)-1H-inda...)
Affinity DataIC50:  0.0730nM. Assay description: Btk enzymatic activity was determined with the LANCE (Lanthanide Chelate Excite) TR-FRET (lime-resolved fluorescence resonance energy transfer) assay...
Ligand InfoPC cidPC sid
In DepthDetails US Patent